Target
Receptor-type tyrosine-protein phosphatase gamma
Ligand
BDBM50355635
Substrate
Meas. Tech.
ChEMBL_776871 (CHEMBL1914005)
IC50
3400±n/a nM
Citation
 Sheriff, SBeno, BRZhai, WKostich, WAMcDonnell, PAKish, KGoldfarb, VGao, MKiefer, SEYanchunas, JHuang, YShi, SZhu, SDzierba, CBronson, JMacor, JEAppiah, KKWestphal, RSO'Connell, JGerritz, SW Small molecule receptor protein tyrosine phosphatase¿ (RPTP¿) ligands that inhibit phosphatase activity via perturbation of the tryptophan-proline-aspartate (WPD) loop. J Med Chem 54:6548-62 (2011)  
Target
Name:
Receptor-type tyrosine-protein phosphatase gamma
Synonyms:
PTPG PTPRG_HUMAN Protein-tyrosine phosphatase gamma (PTPG) Receptor-type tyrosine-protein phosphatase gamma (PTPgamma)
Type:
Protein
Mol. Mass.:
161998.07
Organism:
Homo sapiens (Human)
Description:
P23470
Residue:
1445
  
Inhibitor
Name:
BDBM50355635
Synonyms:
CHEMBL1910882
Type:
Small organic molecule
Emp. Form.:
C12H8Br2O2S2
Mol. Mass.:
408.129
SMILES:
OC(=O)c1sccc1SCc1ccc(Br)c(Br)c1
: