Target
Tyrosine-protein phosphatase non-receptor type 1
Ligand
BDBM50355641
Substrate
Meas. Tech.
ChEMBL_776872 (CHEMBL1914006)
IC50
>100000±n/a nM
Citation
 Sheriff, SBeno, BRZhai, WKostich, WAMcDonnell, PAKish, KGoldfarb, VGao, MKiefer, SEYanchunas, JHuang, YShi, SZhu, SDzierba, CBronson, JMacor, JEAppiah, KKWestphal, RSO'Connell, JGerritz, SW Small molecule receptor protein tyrosine phosphatase¿ (RPTP¿) ligands that inhibit phosphatase activity via perturbation of the tryptophan-proline-aspartate (WPD) loop. J Med Chem 54:6548-62 (2011)  
Target
Name:
Tyrosine-protein phosphatase non-receptor type 1
Synonyms:
PTN1_HUMAN PTPN1 Protein tyrosine phosphatase-1B (PTP1B) Protein-tyrosine phosphatase 1B (PTP1B) Tyrosine-protein phosphatase non-receptor type 1 (PTP1B)
Type:
Protein phosphatase
Mol. Mass.:
49963.76
Organism:
Homo sapiens (Human)
Description:
Human recombinant GST-fusion PTP1B (1-435).
Residue:
435
  
Inhibitor
Name:
BDBM50355641
Synonyms:
CHEMBL1910968
Type:
Small organic molecule
Emp. Form.:
C24H18Cl2N2O3S
Mol. Mass.:
485.382
SMILES:
NCC(=O)Nc1cccc(c1)C#Cc1ccc(C(O)=O)c(SCc2ccc(Cl)c(Cl)c2)c1
: