Target
Phosphatidylinositol 4,5-bisphosphate 3-kinase catalytic subunit alpha isoform
Ligand
BDBM50355688
Substrate
Meas. Tech.
ChEMBL_776284 (CHEMBL1914129)
IC50
5.1±n/a nM
Citation
 Rewcastle, GWGamage, SAFlanagan, JUFrederick, RDenny, WABaguley, BCKestell, PSingh, RKendall, JDMarshall, ESLill, CLLee, WJKolekar, SBuchanan, CMJamieson, SMShepherd, PR Synthesis and biological evaluation of novel analogues of the pan class I phosphatidylinositol 3-kinase (PI3K) inhibitor 2-(difluoromethyl)-1-[4,6-di(4-morpholinyl)-1,3,5-triazin-2-yl]-1H-benzimidazole (ZSTK474). J Med Chem 54:7105-26 (2011)  
Target
Name:
Phosphatidylinositol 4,5-bisphosphate 3-kinase catalytic subunit alpha isoform
Synonyms:
PI3-kinase p110 subunit alpha PI3K Phosphatidylinositol 3-kinase p110α (p110α) Phosphatidylinositol-4,5-bisphosphate 3-kinase catalytic subunit alpha isoform PtdIns-3-kinase p110
Type:
Protein
Mol. Mass.:
124421.84
Organism:
Mus musculus (Mouse)
Description:
P42337
Residue:
1068
  
Inhibitor
Name:
BDBM50355688
Synonyms:
CHEMBL1911123
Type:
Small organic molecule
Emp. Form.:
C21H24F2N6O3
Mol. Mass.:
446.4505
SMILES:
COc1cccc2n(c(nc12)C(F)F)-c1nc(cc(n1)N1CCOCC1)N1CCOCC1
: