Target
Glucocorticoid receptor
Ligand
BDBM50355741
Substrate
Meas. Tech.
ChEMBL_776305 (CHEMBL1914150)
Ki
4.1±n/a nM
Citation
 Weinstein, DSGong, HDoweyko, AMCunningham, MHabte, SWang, JHHolloway, DABurke, CGao, LGuarino, VCarman, JSomerville, JEShuster, DSalter-Cid, LDodd, JHNadler, SGBarrish, JC Azaxanthene based selective glucocorticoid receptor modulators: design, synthesis, and pharmacological evaluation of (S)-4-(5-(1-((1,3,4-thiadiazol-2-yl)amino)-2-methyl-1-oxopropan-2-yl)-5H-chromeno[2,3-b]pyridin-2-yl)-2-fluoro-N,N-dimethylbenzamide (BMS-776532) and its methylene homologue (BMS-791 J Med Chem 54:7318-33 (2011)  
Target
Name:
Glucocorticoid receptor
Synonyms:
GCR_HUMAN GRL Glucocorticoid receptor (GRFP) Nuclear receptor subfamily 3 group C member 1
Type:
Enzyme
Mol. Mass.:
85656.87
Organism:
Homo sapiens (Human)
Description:
P04150
Residue:
777
  
Inhibitor
Name:
BDBM50355741
Synonyms:
CHEMBL1911284
Type:
Small organic molecule
Emp. Form.:
C27H25N5O3S
Mol. Mass.:
499.584
SMILES:
CN(C)C(=O)c1ccc(nc1)-c1ccc2C(c3ccccc3Oc2c1)C(C)(C)C(=O)Nc1nncs1
: