Target
Estrogen receptor
Ligand
BDBM18161
Substrate
Meas. Tech.
ChEMBL_775981 (CHEMBL1912979)
IC50
340000±n/a nM
Citation
 Nagata, NMiyakawa, MAmano, SFuruya, KYamamoto, NNejishima, HInoguchi, K Tetrahydroquinolines as a novel series of nonsteroidal selective androgen receptor modulators: structural requirements for better physicochemical and biological properties. Bioorg Med Chem Lett 21:6310-3 (2011)  
Target
Name:
Estrogen receptor
Synonyms:
ESR1_RAT Esr1 Nr3a1 | estrogen alpha
Type:
Enzyme Catalytic Domain
Mol. Mass.:
67045.89
Organism:
RAT
Description:
estrogen alpha 0 RAT::P06211
Residue:
600
  
Inhibitor
Name:
BDBM18161
Synonyms:
(1S,2S,7S,10R,11S,14S,15S)-14-hydroxy-2,15-dimethyltetracyclo[8.7.0.0^{2,7}.0^{11,15}]heptadecan-5-one CHEMBL27769 Dihydrotestosterone | [3H]DHT
Type:
Steroid
Emp. Form.:
C19H30O2
Mol. Mass.:
290.4403
SMILES:
[H][C@@]12CC[C@H](O)[C@@]1(C)CC[C@@]1([H])[C@@]2([H])CC[C@@]2([H])CC(=O)CC[C@]12C
: