Target
Progesterone receptor
Ligand
BDBM50355936
Substrate
Meas. Tech.
ChEMBL_775980 (CHEMBL1912978)
IC50
3400±n/a nM
Citation
 Nagata, NMiyakawa, MAmano, SFuruya, KYamamoto, NNejishima, HInoguchi, K Tetrahydroquinolines as a novel series of nonsteroidal selective androgen receptor modulators: structural requirements for better physicochemical and biological properties. Bioorg Med Chem Lett 21:6310-3 (2011)  
Target
Name:
Progesterone receptor
Synonyms:
NR3C3 PRGR_RABIT
Type:
PROTEIN
Mol. Mass.:
98665.51
Organism:
Oryctolagus cuniculus
Description:
ChEMBL_775980
Residue:
930
  
Inhibitor
Name:
BDBM50355936
Synonyms:
CHEMBL1910411
Type:
Small organic molecule
Emp. Form.:
C15H23N3O3
Mol. Mass.:
293.3614
SMILES:
CN(C)[C@H]1C[C@H](Nc2ccc(cc12)[N+]([O-])=O)C(C)(C)CO
: