Target
Glucocorticoid receptor
Ligand
BDBM50355936
Substrate
Meas. Tech.
ChEMBL_775982 (CHEMBL1912980)
IC50
49000±n/a nM
Citation
 Nagata, NMiyakawa, MAmano, SFuruya, KYamamoto, NNejishima, HInoguchi, K Tetrahydroquinolines as a novel series of nonsteroidal selective androgen receptor modulators: structural requirements for better physicochemical and biological properties. Bioorg Med Chem Lett 21:6310-3 (2011)  
Target
Name:
Glucocorticoid receptor
Synonyms:
GCR_RAT Glucocorticoid Receptor (GR) Grl | Nr3c1
Type:
Enzyme Catalytic Domain
Mol. Mass.:
87556.83
Organism:
RAT
Description:
Glucocorticoid 0 RAT::P06536
Residue:
795
  
Inhibitor
Name:
BDBM50355936
Synonyms:
CHEMBL1910411
Type:
Small organic molecule
Emp. Form.:
C15H23N3O3
Mol. Mass.:
293.3614
SMILES:
CN(C)[C@H]1C[C@H](Nc2ccc(cc12)[N+]([O-])=O)C(C)(C)CO
: