Target
Mitogen-activated protein kinase 14
Ligand
BDBM50356004
Substrate
Meas. Tech.
ChEMBL_774897 (CHEMBL1913342)
IC50
0.06±n/a nM
Citation
 Eastwood, PGonzález, JGómez, ECaturla, FAguilar, NMir, MAiguadé, JMatassa, VBalagué, COrellana, ADomínguez, M Indolin-2-one p38a inhibitors III: bioisosteric amide replacement. Bioorg Med Chem Lett 21:6253-7 (2011)  
Target
Name:
Mitogen-activated protein kinase 14
Synonyms:
CSAID-binding protein CSBP1 CSPB1 MAP kinase 14 MAP kinase p38 alpha MAPK14 MK14_HUMAN Mitogen-activated protein kinase p38 alpha Stress-activated protein kinase 2a | p38 MAP kinase alpha/beta
Type:
Serine/threonine-protein kinase
Mol. Mass.:
41286.76
Organism:
Homo sapiens (Human)
Description:
Q16539
Residue:
360
  
Inhibitor
Name:
BDBM50356004
Synonyms:
CHEMBL1911339
Type:
Small organic molecule
Emp. Form.:
C24H23F2N3O2
Mol. Mass.:
423.4551
SMILES:
Cc1ccc2c(NC3CC3)noc2c1-c1ccc2c(NC(=O)C22CCC(F)(F)CC2)c1
: