Target
Small conductance calcium-activated potassium channel protein 3
Ligand
BDBM50356158
Substrate
Meas. Tech.
ChEMBL_776012 (CHEMBL1913010)
Ki
837±n/a nM
Citation
 Badarau, EDilly, SDufour, FPoncin, SSeutin, VLiégeois, JF Synthesis and radioligand binding studies of bis-(8-isopropyl-isoquinolinium) derivatives as ligands for apamin-sensitive sites on cloned SK2 and SK3 channels. Bioorg Med Chem Lett 21:6756-9 (2011)  
Target
Name:
Small conductance calcium-activated potassium channel protein 3
Synonyms:
K3 KCNN3_HUMAN Small conductance calcium-activated potassium channel protein 3 (KCa2.3)
Type:
Protein
Mol. Mass.:
82053.75
Organism:
Homo sapiens (Human)
Description:
Q9UGI6
Residue:
731
  
Inhibitor
Name:
BDBM50356158
Synonyms:
CHEMBL1909928
Type:
Small organic molecule
Emp. Form.:
C29H36N2
Mol. Mass.:
412.6084
SMILES:
CC(C)c1cccc2cc[n+](C)c(CCCc3[n+](C)ccc4cccc(C(C)C)c34)c12
: