Target
Polyphenol oxidase 2
Ligand
BDBM50356166
Substrate
Meas. Tech.
ChEMBL_776076 (CHEMBL1912772)
IC50
600±n/a nM
Citation
 Thanigaimalai, PLee, KCSharma, VKJoo, CCho, WJRoh, EKim, YJung, SH Structural requirement of phenylthiourea analogs for their inhibitory activity of melanogenesis and tyrosinase. Bioorg Med Chem Lett 21:6824-8 (2011)  
Target
Name:
Polyphenol oxidase 2
Synonyms:
Monophenol monooxygenase PPO2 Tyrosinase
Type:
Protein
Mol. Mass.:
63923.66
Organism:
Agaricus bisporus (Common mushroom)
Description:
O42713
Residue:
556
  
Inhibitor
Name:
BDBM50356166
Synonyms:
CHEMBL1088657
Type:
Small organic molecule
Emp. Form.:
C8H10N2S
Mol. Mass.:
166.243
SMILES:
Cc1cccc(NC(N)=S)c1
: