Target
A disintegrin and metalloproteinase with thrombospondin motifs 4
Ligand
BDBM24025
Substrate
Meas. Tech.
ChEMBL_774906 (CHEMBL1913351)
IC50
3000±n/a nM
Citation
 Hu, YXing, LThomason, JRXiang, JIpek, MGuler, SLi, HSabatini, JChockalingam, PReifenberg, ESheldon, RMorris, EAGeorgiadis, KETam, S Continued exploration of biphenylsulfonamide scaffold as a platform for aggrecanase-1 inhibition. Bioorg Med Chem Lett 21:6800-3 (2011)  
Target
Name:
A disintegrin and metalloproteinase with thrombospondin motifs 4
Synonyms:
A disintegrin and metalloproteinase with thrombospondin motifs 4 (ADAMTS-4) ATS4_HUMAN KIAA0688 | Metalloproteinase with thrombospondin motifs 4 (ADAMTS-4)
Type:
Enzyme
Mol. Mass.:
90214.54
Organism:
Homo sapiens (Human)
Description:
O75173
Residue:
837
  
Inhibitor
Name:
BDBM24025
Synonyms:
(2R)-3-methyl-2-[(4-phenylbenzene)sulfonamido]butanoic acid biphenylsulfonamide carboxylate, 2
Type:
Small organic molecule
Emp. Form.:
C17H19NO4S
Mol. Mass.:
333.402
SMILES:
CC(C)[C@@H](NS(=O)(=O)c1ccc(cc1)-c1ccccc1)C(O)=O
: