Target
Calcitonin gene-related peptide 1
Ligand
BDBM50000743
Substrate
Meas. Tech.
ChEMBL_775089 (CHEMBL1912348)
Ki
5.5±n/a nM
Citation
 Zartman, CBBell, IMGallicchio, SNGraham, SLKane, SAMallee, JJRutledge, RZSalvatore, CAVacca, JPWilliams, TM Identification of a novel RAMP-independent CGRP receptor antagonist. Bioorg Med Chem Lett 21:6705-8 (2011)  
Target
Name:
Calcitonin gene-related peptide 1
Synonyms:
CALC1 CALCA_HUMAN Calcitonin gene-related peptide (CGRP alpha) | Calcitonin gene-related peptide 1
Type:
Enzyme
Mol. Mass.:
13902.80
Organism:
Homo sapiens (Human)
Description:
P06881
Residue:
128
  
Inhibitor
Name:
BDBM50000743
Synonyms:
CHEMBL525571 h alpha-CGRP8-37
Type:
Small organic molecule
Emp. Form.:
C139H230N44O38
Mol. Mass.:
3125.5855
SMILES:
CC(C)C[C@H](NC(=O)CNC(=O)[C@H](C)NC(=O)[C@H](CC(C)C)NC(=O)[C@H](CCCNC(N)=N)NC(=O)[C@H](Cc1cnc[nH]1)NC(=O)[C@@H](NC(=O)[C@@H](N)C(C)C)[C@@H](C)O)C(=O)N[C@@H](CC(C)C)C(=O)N[C@@H](CO)C(=O)N[C@@H](CCCNC(N)=N)C(=O)N[C@@H](CO)C(=O)NCC(=O)NCC(=O)N[C@@H](C(C)C)C(=O)N[C@@H](C(C)C)C(=O)N[C@@H](CCCCN)C(=O)N[C@@H](CC(N)=O)C(=O)N[C@@H](CC(N)=O)C(=O)N[C@@H](Cc1ccccc1)C(=O)N[C@@H](C(C)C)C(=O)N1CCC[C@H]1C(=O)N[C@@H]([C@@H](C)O)C(=O)N[C@@H](CC(N)=O)C(=O)N[C@@H](C(C)C)C(=O)NCC(=O)N[C@@H](CO)C(=O)N[C@@H](CCCCN)C(=O)N[C@@H](C)C(=O)N[C@@H](Cc1ccccc1)C(N)=O
: