Target
Calcitonin gene-related peptide 1
Ligand
BDBM50356287
Substrate
Meas. Tech.
ChEMBL_775008 (CHEMBL1912163)
IC50
2600±n/a nM
Citation
 Zartman, CBBell, IMGallicchio, SNGraham, SLKane, SAMallee, JJRutledge, RZSalvatore, CAVacca, JPWilliams, TM Identification of a novel RAMP-independent CGRP receptor antagonist. Bioorg Med Chem Lett 21:6705-8 (2011)  
Target
Name:
Calcitonin gene-related peptide 1
Synonyms:
CALC1 CALCA_HUMAN Calcitonin gene-related peptide (CGRP alpha) | Calcitonin gene-related peptide 1
Type:
Enzyme
Mol. Mass.:
13902.80
Organism:
Homo sapiens (Human)
Description:
P06881
Residue:
128
  
Inhibitor
Name:
BDBM50356287
Synonyms:
CHEMBL1910941
Type:
Small organic molecule
Emp. Form.:
C20H18F2N4O4S
Mol. Mass.:
448.443
SMILES:
Oc1c(nc(N2CCCCS2(=O)=O)c2cccnc12)C(=O)NCc1cc(F)cc(F)c1
: