Target
Calcitonin gene-related peptide 1
Ligand
BDBM50356278
Substrate
Meas. Tech.
ChEMBL_775008 (CHEMBL1912163)
IC50
2700±n/a nM
Citation
 Zartman, CBBell, IMGallicchio, SNGraham, SLKane, SAMallee, JJRutledge, RZSalvatore, CAVacca, JPWilliams, TM Identification of a novel RAMP-independent CGRP receptor antagonist. Bioorg Med Chem Lett 21:6705-8 (2011)  
Target
Name:
Calcitonin gene-related peptide 1
Synonyms:
CALC1 CALCA_HUMAN Calcitonin gene-related peptide (CGRP alpha) | Calcitonin gene-related peptide 1
Type:
Enzyme
Mol. Mass.:
13902.80
Organism:
Homo sapiens (Human)
Description:
P06881
Residue:
128
  
Inhibitor
Name:
BDBM50356278
Synonyms:
CHEMBL1910947
Type:
Small organic molecule
Emp. Form.:
C17H16BrF2N3O4S
Mol. Mass.:
476.292
SMILES:
Oc1c(Br)cc(nc1C(=O)NCc1cc(F)cc(F)c1)N1CCCCS1(=O)=O
: