Target
Calcitonin gene-related peptide 1
Ligand
BDBM50356295
Substrate
Meas. Tech.
ChEMBL_775008 (CHEMBL1912163)
IC50
>10000±n/a nM
Citation
 Zartman, CBBell, IMGallicchio, SNGraham, SLKane, SAMallee, JJRutledge, RZSalvatore, CAVacca, JPWilliams, TM Identification of a novel RAMP-independent CGRP receptor antagonist. Bioorg Med Chem Lett 21:6705-8 (2011)  
Target
Name:
Calcitonin gene-related peptide 1
Synonyms:
CALC1 CALCA_HUMAN Calcitonin gene-related peptide (CGRP alpha) | Calcitonin gene-related peptide 1
Type:
Enzyme
Mol. Mass.:
13902.80
Organism:
Homo sapiens (Human)
Description:
P06881
Residue:
128
  
Inhibitor
Name:
BDBM50356295
Synonyms:
CHEMBL1910950
Type:
Small organic molecule
Emp. Form.:
C16H23BrN4O5S
Mol. Mass.:
463.347
SMILES:
CC(C)(C)NC(=O)CNC(=O)c1nc(cc(Br)c1O)N1CCCCS1(=O)=O
: