Target
Nitric oxide synthase, endothelial
Ligand
BDBM50356501
Substrate
Meas. Tech.
ChEMBL_775892 (CHEMBL1912865)
EC50
>100000±n/a nM
Citation
 Gahman, TCHerbert, MRLang, HThayer, ASymons, KTNguyen, PMMassari, MEDozier, SZhang, YSablad, MRao, TSNoble, SAShiau, AKHassig, CA Identification and SAR of selective inducible nitric oxide synthase (iNOS) dimerization inhibitors. Bioorg Med Chem Lett 21:6888-94 (2011)  
Target
Name:
Nitric oxide synthase, endothelial
Synonyms:
Constitutive NOS Endothelial NOS NOS type III NOS3_HUMAN Nitric oxide synthase (inducible and endothelial) Nitric-oxide synthase (endothelial and brain) eNOS
Type:
Enzyme Catalytic Domain
Mol. Mass.:
133297.84
Organism:
Homo sapiens (Human)
Description:
P29474
Residue:
1203
  
Inhibitor
Name:
BDBM50356501
Synonyms:
CHEMBL1911996
Type:
Small organic molecule
Emp. Form.:
C18H20N10O2S
Mol. Mass.:
440.482
SMILES:
C(CNCc1ccc2OCOc2c1)CN(Cc1nnn[nH]1)c1nc(ns1)-n1ccnc1
: