Target
Choline kinase alpha
Ligand
BDBM50356555
Substrate
Meas. Tech.
ChEMBL_776093 (CHEMBL1912789)
IC50
6150±n/a nM
Citation
 Martín-Cantalejo, YSáez, BMonterde, MIMurillo, MTBraña, MF Synthesis and biological activity of new bispyridinium salts of 4,4'-bispyridyl-5,5'-perfluoroalkyl-2,2'-bisoxazoles. Eur J Med Chem 46:5662-7 (2011)  
Target
Name:
Choline kinase alpha
Synonyms:
CHK CHKA_HUMAN Choline kinase alpha
Type:
PROTEIN
Mol. Mass.:
52248.44
Organism:
Homo sapiens (Human)
Description:
ChEMBL_1290064
Residue:
457
  
Inhibitor
Name:
BDBM50356555
Synonyms:
CHEMBL1909972
Type:
Small organic molecule
Emp. Form.:
C41H32F12N6O4
Mol. Mass.:
900.7103
SMILES:
CN(C)C(=O)C[n+]1ccc(cc1)-c1nc(oc1C(F)(F)F)-c1ccc(cc1)C(c1ccc(cc1)-c1nc(c(o1)C(F)(F)F)-c1cc[n+](CC(=O)N(C)C)cc1)(C(F)(F)F)C(F)(F)F
: