Target
5-hydroxytryptamine receptor 1A
Ligand
BDBM86708
Substrate
Meas. Tech.
ChEMBL_775009 (CHEMBL1912164)
Ki
0.39±n/a nM
Citation
 Al Hussainy, RVerbeek, Jvan der Born, DBooij, JHerscheid, JK Design, synthesis and in vitro evaluation of bridgehead fluoromethyl analogs of N-{2-[4-(2-methoxyphenyl)piperazin-1-yl]ethyl}-N-(pyridin-2-yl)cyclohexanecarboxamide (WAY-100635) for the 5-HT(1A) receptor. Eur J Med Chem 46:5728-35 (2011)  
Target
Name:
5-hydroxytryptamine receptor 1A
Synonyms:
5-HT-1A 5-hydroxytryptamine receptor 1A (5-HT-1A) ADRB2RL1 Dopamine D2 receptor and serotonin 1a receptor HTR1A | Serotonin receptor 1A
Type:
Mol. Mass.:
46122.49
Organism:
Homo sapiens (Human)
Description:
Residue:
422
  
Inhibitor
Name:
BDBM86708
Synonyms:
CAS_146714-97-8 CHEMBL514874 NSC_104911 | WAY 100,635
Type:
Small organic molecule
Emp. Form.:
C25H34N4O2
Mol. Mass.:
422.5631
SMILES:
COc1ccccc1N1CCN(CCN(C(=O)C2CCCCC2)c2ccccn2)CC1
: