Target
Cyclin-A2/Cyclin-dependent kinase 2
Ligand
BDBM5718
Substrate
Meas. Tech.
ChEMBL_775024 (CHEMBL1912179)
IC50
7000±n/a nM
Citation
 Ibrahim, DAIsmail, NS Design, synthesis and biological study of novel pyrido[2,3-d]pyrimidine as anti-proliferative CDK2 inhibitors. Eur J Med Chem 46:5825-32 (2011)  
Target
Name:
Cyclin-A2/Cyclin-dependent kinase 2
Synonyms:
CDK2-CyclinA CDK2/Cyclin A Cyclin A2/dependent kinase 2 Cyclin-Dependent Kinase 2 (CDK2A)
Type:
Protein Complex
Mol. Mass.:
Description:
Cdk2/Cyclin A kinase was purified from insect cells coinfected with Cyclin A/Cdk2 baculovirus.
Components:
This complex has 2 components.
Component 1
Name:
Cyclin-dependent kinase 2
Synonyms:
CDK2 CDK2_HUMAN Cell division protein kinase 2 Protein cereblon/Cyclin-dependent kinase 2 | p33 protein kinase
Type:
Enzyme Subunit
Mol. Mass.:
33938.17
Organism:
Homo sapiens (Human)
Description:
P24941
Residue:
298
  
Component 2
Name:
Cyclin-A2
Synonyms:
CCN1 CCNA1 CCNA2_HUMAN Cyclin-A
Type:
Enzyme Subunit
Mol. Mass.:
48550.19
Organism:
Homo sapiens (Human)
Description:
P20248
Residue:
432
  
Inhibitor
Name:
BDBM5718
Synonyms:
2,6,9-Trisubstituted purine deriv. 26 2-{[6-(benzylamino)-9-methyl-9H-purin-2-yl]amino}ethanol CHEMBL280074 purine deriv. 5
Type:
Small organic molecule
Emp. Form.:
C15H18N6O
Mol. Mass.:
298.343
SMILES:
Cn1cnc2c(NCc3ccccc3)nc(NCCO)nc12
: