Target
Prostaglandin D2 receptor 2
Ligand
BDBM50356731
Substrate
Meas. Tech.
ChEMBL_785711 (CHEMBL1920639)
Ki
46±n/a nM
Citation
 Crosignani, SPrêtre, AJorand-Lebrun, CFraboulet, GSeenisamy, JAugustine, JKMissotten, MHumbert, YCleva, CAbla, NDaff, HSchott, OSchneider, MBurgat-Charvillon, FRivron, DHamernig, IArrighi, JFGaudet, MZimmerli, SCJuillard, PJohnson, Z Discovery of potent, selective, and orally bioavailable alkynylphenoxyacetic acid CRTH2 (DP2) receptor antagonists for the treatment of allergic inflammatory diseases. J Med Chem 54:7299-317 (2011)  
Target
Name:
Prostaglandin D2 receptor 2
Synonyms:
CD_antigen=CD294 Chemoattractant Receptor-homologous molecule expressed on T-helper type 2 cells (CRTH2) Chemoattractant receptor-homologous molecule expressed on Th2 cells (CRTH2) G protein-coupled receptor 44 GPR44 PTGDR2 Prostaglandin D2 receptor 2 | Prostaglandin D2 receptor 2 (PGD2)
Type:
Enzyme
Mol. Mass.:
43295.45
Organism:
Homo sapiens (Human)
Description:
Q9Y5Y4
Residue:
395
  
Inhibitor
Name:
BDBM50356731
Synonyms:
CHEMBL1917784
Type:
Small organic molecule
Emp. Form.:
C24H26ClNO6S
Mol. Mass.:
491.984
SMILES:
CCN(CC)C(=O)c1ccc(cc1S(=O)(=O)C(C)C)C#Cc1cc(Cl)ccc1OCC(O)=O
: