Target
Prostaglandin D2 receptor 2
Ligand
BDBM50356677
Substrate
Meas. Tech.
ChEMBL_785717 (CHEMBL1920645)
IC50
23±n/a nM
Citation
 Crosignani, SPrêtre, AJorand-Lebrun, CFraboulet, GSeenisamy, JAugustine, JKMissotten, MHumbert, YCleva, CAbla, NDaff, HSchott, OSchneider, MBurgat-Charvillon, FRivron, DHamernig, IArrighi, JFGaudet, MZimmerli, SCJuillard, PJohnson, Z Discovery of potent, selective, and orally bioavailable alkynylphenoxyacetic acid CRTH2 (DP2) receptor antagonists for the treatment of allergic inflammatory diseases. J Med Chem 54:7299-317 (2011)  
Target
Name:
Prostaglandin D2 receptor 2
Synonyms:
CD_antigen=CD294 Chemoattractant Receptor-homologous molecule expressed on T-helper type 2 cells (CRTH2) Chemoattractant receptor-homologous molecule expressed on Th2 cells (CRTH2) G protein-coupled receptor 44 GPR44 PTGDR2 Prostaglandin D2 receptor 2 | Prostaglandin D2 receptor 2 (PGD2)
Type:
Enzyme
Mol. Mass.:
43295.45
Organism:
Homo sapiens (Human)
Description:
Q9Y5Y4
Residue:
395
  
Inhibitor
Name:
BDBM50356677
Synonyms:
CHEMBL1917592
Type:
Small organic molecule
Emp. Form.:
C19H16ClFO5S
Mol. Mass.:
410.844
SMILES:
CCCS(=O)(=O)c1ccc(F)c(c1)C#Cc1cc(Cl)ccc1OCC(O)=O
: