Target
Acetylcholinesterase
Ligand
BDBM50327935
Substrate
Meas. Tech.
ChEMBL_785863 (CHEMBL1921132)
IC50
100±n/a nM
Citation
 Korabecny, JMusilek, KZemek, FHorova, AHolas, ONepovimova, EOpletalova, VHroudova, JFisar, ZJung, YSKuca, K Synthesis and in vitro evaluation of 7-methoxy-N-(pent-4-enyl)-1,2,3,4-tetrahydroacridin-9-amine-new tacrine derivate with cholinergic properties. Bioorg Med Chem Lett 21:6563-6 (2011)  
Target
Name:
Acetylcholinesterase
Synonyms:
ACES_HUMAN Acetylcholinesterase (AChE) | Acetylcholinesterase (human AChE)
Type:
Enzyme
Mol. Mass.:
67792.70
Organism:
Homo sapiens (Human)
Description:
P22303
Residue:
614
  
Inhibitor
Name:
BDBM50327935
Synonyms:
CHEMBL1257885 N-n-hexyl-7-methoxytacrine hydrochloride
Type:
Small organic molecule
Emp. Form.:
C20H28N2O
Mol. Mass.:
312.4491
SMILES:
CCCCCCNc1c2CCCCc2nc2ccc(OC)cc12
: