Target
Histamine H4 receptor
Ligand
BDBM50356884
Substrate
Meas. Tech.
ChEMBL_785118 (CHEMBL1920856)
Ki
1.56±n/a nM
Citation
 Mowbray, CEBell, ASClarke, NPCollins, MJones, RMLane, CALiu, WLNewman, SDParadowski, MSchenck, EJSelby, MDSwain, NAWilliams, DH Challenges of drug discovery in novel target space. The discovery and evaluation of PF-3893787: a novel histamine H4 receptor antagonist. Bioorg Med Chem Lett 21:6596-602 (2011)  
Target
Name:
Histamine H4 receptor
Synonyms:
AXOR35 GPCR105 HH4R HRH4 Histamine H4 receptor Histamine receptor (H3 and H4) SP9144
Type:
G Protein-Coupled Receptor (GPCR)
Mol. Mass.:
44517.02
Organism:
Homo sapiens (Human)
Description:
Binding assays were using CHO cells stably expressing hH4R receptors.
Residue:
390
  
Inhibitor
Name:
BDBM50356884
Synonyms:
CHEMBL1915540
Type:
Small organic molecule
Emp. Form.:
C13H22N6
Mol. Mass.:
262.354
SMILES:
CN[C@@H]1CCN(C1)c1cc(NCC2CC2)nc(N)n1
: