Target
Histamine receptor H4
Ligand
BDBM22566
Substrate
Meas. Tech.
ChEMBL_785248 (CHEMBL1921329)
Ki
1071.52±n/a nM
Citation
 Mowbray, CEBell, ASClarke, NPCollins, MJones, RMLane, CALiu, WLNewman, SDParadowski, MSchenck, EJSelby, MDSwain, NAWilliams, DH Challenges of drug discovery in novel target space. The discovery and evaluation of PF-3893787: a novel histamine H4 receptor antagonist. Bioorg Med Chem Lett 21:6596-602 (2011)  
Target
Name:
Histamine receptor H4
Synonyms:
HISTAMINE H4 Histamine H4 receptor
Type:
Enzyme Catalytic Domain
Mol. Mass.:
44536.99
Organism:
GUINEA PIG
Description:
HISTAMINE H4 HRH4 GUINEA PIG::Q91ZY3
Residue:
389
  
Inhibitor
Name:
BDBM22566
Synonyms:
5-chloro-2-[(4-methylpiperazin-1-yl)carbonyl]-1H-indole JNJ 7777120
Type:
Small organic molecule
Emp. Form.:
C14H16ClN3O
Mol. Mass.:
277.749
SMILES:
CN1CCN(CC1)C(=O)c1cc2cc(Cl)ccc2[nH]1
: