Target
Prostaglandin D2 receptor 2
Ligand
BDBM50357112
Substrate
Meas. Tech.
ChEMBL_787459 (CHEMBL1919378)
IC50
1.3±n/a nM
Citation
 Luker, TBonnert, RBrough, SCook, ARDickinson, MRDougall, ILogan, CMohammed, RTPaine, SSanganee, HJSargent, CSchmidt, JATeague, SThom, S Substituted indole-1-acetic acids as potent and selective CRTh2 antagonists-discovery of AZD1981. Bioorg Med Chem Lett 21:6288-92 (2011)  
Target
Name:
Prostaglandin D2 receptor 2
Synonyms:
CD_antigen=CD294 Chemoattractant Receptor-homologous molecule expressed on T-helper type 2 cells (CRTH2) Chemoattractant receptor-homologous molecule expressed on Th2 cells (CRTH2) G protein-coupled receptor 44 GPR44 PTGDR2 Prostaglandin D2 receptor 2 | Prostaglandin D2 receptor 2 (PGD2)
Type:
Enzyme
Mol. Mass.:
43295.45
Organism:
Homo sapiens (Human)
Description:
Q9Y5Y4
Residue:
395
  
Inhibitor
Name:
BDBM50357112
Synonyms:
CHEMBL1917427
Type:
Small organic molecule
Emp. Form.:
C18H15ClFNO2S
Mol. Mass.:
363.834
SMILES:
Cc1c(Sc2ccc(Cl)cc2)c2c(C)c(F)ccc2n1CC(O)=O
: