Target
Histamine H3 receptor
Ligand
BDBM50357156
Substrate
Meas. Tech.
ChEMBL_787546 (CHEMBL1919507)
Ki
18±n/a nM
Citation
 Dandu, RRGruner, JAMathiasen, JRAimone, LDHostetler, GBenfield, CBendesky, RJMarcy, VRRaddatz, RHudkins, RL Synthesis and evaluation of pyridazinone-phenethylamine derivatives as selective and orally bioavailable histamine H3 receptor antagonists with robust wake-promoting activity. Bioorg Med Chem Lett 21:6362-5 (2011)  
Target
Name:
Histamine H3 receptor
Synonyms:
HH3R Hrh3
Type:
G Protein-Coupled Receptor (GPCR)
Mol. Mass.:
48607.98
Organism:
Rattus norvegicus (rat)
Description:
Residue:
445
  
Inhibitor
Name:
BDBM50357156
Synonyms:
CHEMBL1917640
Type:
Small organic molecule
Emp. Form.:
C24H27N3O
Mol. Mass.:
373.4907
SMILES:
C[C@@H]1CCCN1CCc1ccc(cc1)-c1ccc(=O)n(Cc2ccccc2)n1
: