Target
Histamine H3 receptor
Ligand
BDBM50350021
Substrate
Meas. Tech.
ChEMBL_787546 (CHEMBL1919507)
Ki
7±n/a nM
Citation
 Dandu, RRGruner, JAMathiasen, JRAimone, LDHostetler, GBenfield, CBendesky, RJMarcy, VRRaddatz, RHudkins, RL Synthesis and evaluation of pyridazinone-phenethylamine derivatives as selective and orally bioavailable histamine H3 receptor antagonists with robust wake-promoting activity. Bioorg Med Chem Lett 21:6362-5 (2011)  
Target
Name:
Histamine H3 receptor
Synonyms:
HH3R Hrh3
Type:
G Protein-Coupled Receptor (GPCR)
Mol. Mass.:
48607.98
Organism:
Rattus norvegicus (rat)
Description:
Residue:
445
  
Inhibitor
Name:
BDBM50350021
Synonyms:
CHEMBL1813067
Type:
Small organic molecule
Emp. Form.:
C18H23N3O2
Mol. Mass.:
313.3941
SMILES:
C[C@@H]1CCCN1CCCOc1ccc(cc1)-c1ccc(=O)[nH]n1
: