Target
G-protein coupled receptor 35
Ligand
BDBM50357187
Substrate
Meas. Tech.
ChEMBL_787887 (CHEMBL1918727)
EC50
32±n/a nM
Citation
 Deng, HHu, HHe, MHu, JNiu, WFerrie, AMFang, Y Discovery of 2-(4-methylfuran-2(5H)-ylidene)malononitrile and thieno[3,2-b]thiophene-2-carboxylic acid derivatives as G protein-coupled receptor 35 (GPR35) agonists. J Med Chem 54:7385-96 (2011)  
Target
Name:
G-protein coupled receptor 35
Synonyms:
G protein-coupled receptor 35 GPR35_HUMAN
Type:
Enzyme Catalytic Domain
Mol. Mass.:
34085.57
Organism:
Homo sapiens (Human)
Description:
gi_33695097
Residue:
309
  
Inhibitor
Name:
BDBM50357187
Synonyms:
CHEMBL1914576
Type:
Small organic molecule
Emp. Form.:
C16H9Cl2N3O
Mol. Mass.:
330.168
SMILES:
[#6]-[#6]1=[#6](C#N)\[#6](-[#8]C1([#6])c1ccc(Cl)c(Cl)c1)=[#6](\C#N)C#N
: