Target
cAMP-specific 3',5'-cyclic phosphodiesterase 7B
Ligand
BDBM50357234
Substrate
Meas. Tech.
ChEMBL_788341 (CHEMBL1918022)
IC50
>2000±n/a nM
Citation
 Hughes, ROMaddux, TJoseph Rogier, DLu, SWalker, JKJon Jacobsen, ERumsey, JMZheng, YMacinnes, ABond, BRHan, S Investigation of the pyrazinones as PDE5 inhibitors: evaluation of regioisomeric projections into the solvent region. Bioorg Med Chem Lett 21:6348-52 (2011)  
Target
Name:
cAMP-specific 3',5'-cyclic phosphodiesterase 7B
Synonyms:
3',5'-cyclic phosphodiesterase PDE7B_HUMAN Phosphodiesterase 7B (PDE7B) | cAMP-specific 3',5'-cyclic phosphodiesterase 7B
Type:
Enzyme
Mol. Mass.:
51842.76
Organism:
Homo sapiens (Human)
Description:
Q9NP56
Residue:
450
  
Inhibitor
Name:
BDBM50357234
Synonyms:
CHEMBL1916475
Type:
Small organic molecule
Emp. Form.:
C23H30N6O4
Mol. Mass.:
454.5221
SMILES:
CCCOCCn1c2cc(nnc2c(NC2CCC(O)CC2)nc1=O)-c1ccc(OC)nc1
: