Target
Aryl hydrocarbon receptor
Ligand
BDBM50357339
Substrate
Meas. Tech.
ChEMBL_788551 (CHEMBL1918491)
EC50
>10000±n/a nM
Citation
 Kim, KHMaderna, ASchnute, MEHegen, MMohan, SMiyashiro, JLin, LLi, EKeegan, SLussier, JWrocklage, CNickerson-Nutter, CLWittwer, AJSoutter, HCaspers, NHan, SKurumbail, RDunussi-Joannopoulos, KDouhan, JWissner, A Imidazo[1,5-a]quinoxalines as irreversible BTK inhibitors for the treatment of rheumatoid arthritis. Bioorg Med Chem Lett 21:6258-63 (2011)  
Target
Name:
Aryl hydrocarbon receptor
Synonyms:
AHR_MOUSE Ahr | Aryl hydrocarbon receptor
Type:
Protein
Mol. Mass.:
95014.92
Organism:
Mus musculus (Mouse)
Description:
P30561
Residue:
848
  
Inhibitor
Name:
BDBM50357339
Synonyms:
CHEMBL1916897
Type:
Small organic molecule
Emp. Form.:
C24H24ClFN6O
Mol. Mass.:
466.938
SMILES:
CN(C)C\C=C\C(=O)N(C)c1cc2c(cc1Cl)nc(Nc1cc(F)ccc1C)c1cncn21
: