Target
Epidermal growth factor receptor
Ligand
BDBM50357339
Substrate
Meas. Tech.
ChEMBL_787272 (CHEMBL1919050)
IC50
3.35±n/a nM
Citation
 Kim, KHMaderna, ASchnute, MEHegen, MMohan, SMiyashiro, JLin, LLi, EKeegan, SLussier, JWrocklage, CNickerson-Nutter, CLWittwer, AJSoutter, HCaspers, NHan, SKurumbail, RDunussi-Joannopoulos, KDouhan, JWissner, A Imidazo[1,5-a]quinoxalines as irreversible BTK inhibitors for the treatment of rheumatoid arthritis. Bioorg Med Chem Lett 21:6258-63 (2011)  
Target
Name:
Epidermal growth factor receptor
Synonyms:
EGF Receptor Substrate EGFR_HUMAN ERBB1 Epidermal Growth Factor Receptor erbB-1 Epidermal growth factor receptor (EGFR) HER1 Proto-oncogene c-ErbB-1 Tyrosine-Protein Kinase ErbB-1
Type:
Receptor Kinase Domain
Mol. Mass.:
134279.59
Organism:
Homo sapiens (Human)
Description:
P00533
Residue:
1210
  
Inhibitor
Name:
BDBM50357339
Synonyms:
CHEMBL1916897
Type:
Small organic molecule
Emp. Form.:
C24H24ClFN6O
Mol. Mass.:
466.938
SMILES:
CN(C)C\C=C\C(=O)N(C)c1cc2c(cc1Cl)nc(Nc1cc(F)ccc1C)c1cncn21
: