Target
Type 1 fimbrin D-mannose specific adhesin
Ligand
BDBM50357414
Substrate
Meas. Tech.
ChEMBL_788106 (CHEMBL1919133)
IC50
565±n/a nM
Citation
 Schwardt, ORabbani, SHartmann, MAbgottspon, DWittwer, MKleeb, SZalewski, ASmieško, MCutting, BErnst, B Design, synthesis and biological evaluation of mannosyl triazoles as FimH antagonists. Bioorg Med Chem 19:6454-73 (2011)  
Target
Name:
Type 1 fimbrin D-mannose specific adhesin
Synonyms:
Adhesin protein fimH fimH
Type:
PROTEIN
Mol. Mass.:
31474.61
Organism:
Escherichia coli (strain K12)
Description:
ChEMBL_1298296
Residue:
300
  
Inhibitor
Name:
BDBM50357414
Synonyms:
CHEMBL1917482
Type:
Small organic molecule
Emp. Form.:
C16H21N3O5
Mol. Mass.:
335.355
SMILES:
Cc1ccc(cc1)-c1cn(C[C@H]2O[C@H](CO)[C@@H](O)[C@H](O)[C@@H]2O)nn1
: