Target
Bcl2-associated agonist of cell death
Ligand
BDBM50357607
Substrate
Meas. Tech.
ChEMBL_788226 (CHEMBL1919428)
EC50
40±n/a nM
Citation
 Pierre, FStefan, ENédellec, ASChevrel, MCRegan, CFSiddiqui-Jain, AMacalino, DStreiner, NDrygin, DHaddach, MO'Brien, SEAnderes, KRyckman, DM 7-(4H-1,2,4-Triazol-3-yl)benzo[c][2,6]naphthyridines: a novel class of Pim kinase inhibitors with potent cell antiproliferative activity. Bioorg Med Chem Lett 21:6687-92 (2011)  
Target
Name:
Bcl2-associated agonist of cell death
Synonyms:
BAD BBC6 Bcl-2-binding component 6 Bcl-XL/Bcl-2-associated death promoter Bcl2-L-8 | Bcl2-antagonist of cell death (BAD)
Type:
PROTEIN
Mol. Mass.:
18393.69
Organism:
Homo sapiens (Human)
Description:
ChEMBL_478760
Residue:
168
  
Inhibitor
Name:
BDBM50357607
Synonyms:
CHEMBL1915641
Type:
Small organic molecule
Emp. Form.:
C26H24FN7O
Mol. Mass.:
469.5135
SMILES:
Fc1cc(OCCN2CCCC2)ccc1Nc1nc2c(cccc2c2cnccc12)-c1nnc[nH]1
: