Target
Prostacyclin receptor
Ligand
BDBM50357623
Substrate
Meas. Tech.
ChEMBL_788407 (CHEMBL1918135)
Ki
>10000±n/a nM
Citation
 Iwahashi, MNaganawa, AKinoshita, AShimabukuro, ANishiyama, TOgawa, SMatsunaga, YTsukamoto, KOkada, YMatsumoto, RNambu, FOumi, ROdagaki, YKatagi, JYano, KTani, KNakai, HToda, M Discovery of new orally active prostaglandin D2 receptor antagonists. Bioorg Med Chem 19:6935-48 (2011)  
Target
Name:
Prostacyclin receptor
Synonyms:
PGI receptor PRIPR Prostacyclin (IP) Receptor Prostaglandin I Prostaglandin I2 receptor | Prostanoid IP receptor
Type:
G Protein-Coupled Receptor (GPCR)
Mol. Mass.:
40968.22
Organism:
Homo sapiens (Human)
Description:
The membranes prepared from human platelet were used in binding assay.
Residue:
386
  
Inhibitor
Name:
BDBM50357623
Synonyms:
CHEMBL1915671
Type:
Small organic molecule
Emp. Form.:
C27H28N2O5
Mol. Mass.:
460.5216
SMILES:
CN1C[C@@H](COc2cc(C)c(cc2C)C(=O)Nc2cccc(CC(O)=O)c2)Oc2ccccc12
: