Target
Bcl-2-like protein 1
Ligand
BDBM50357754
Substrate
Meas. Tech.
ChEMBL_785843 (CHEMBL1921059)
Ki
68±n/a nM
Citation
 Goreshnik, IBrock, AMMaly, DJ Biochemical and pharmacological profiling of the pro-survival protein Bcl-xL. Bioorg Med Chem Lett 21:4951-5 (2011)  
Target
Name:
Bcl-2-like protein 1
Synonyms:
Anti-apoptotic Bcl-2 protein Apoptosis regulator Bcl-X BCL2-like 1 isoform 1 BCL2L1 Bcl-2-like protein 1 (Bcl-XL) Bcl-xL/Bcl-2-binding component 3 Bcl2-antagonist of cell death (BAD)
Type:
Mitochondrion membrane; Single-pass membrane protein
Mol. Mass.:
26039.60
Organism:
Homo sapiens (Human)
Description:
Residue:
233
  
Inhibitor
Name:
BDBM50357754
Synonyms:
CHEMBL1916192
Type:
Small organic molecule
Emp. Form.:
C39H45F3N6O5S2
Mol. Mass.:
798.937
SMILES:
CC1CN(CC(C)N1Cc1ccccc1C(F)(F)F)c1ccc(cc1)C(=O)NS(=O)(=O)c1ccc(N[C@H](CCN(C)C)CSc2ccccc2)c(c1)[N+]([O-])=O
: