Target
Sphingosine 1-phosphate receptor 1
Ligand
BDBM50357793
Substrate
Meas. Tech.
ChEMBL_786287 (CHEMBL1920392)
EC50
1±n/a nM
Citation
 Buzard, DHan, SThoresen, LMoody, JLopez, LKawasaki, ASchrader, TSage, CGao, YEdwards, JBarden, JThatte, JFu, LSolomon, MLiu, LAl-Shamma, HGatlin, JLe, MXing, CEspinola, SJones, RM Discovery and characterization of potent and selective 4-oxo-4-(5-(5-phenyl-1,2,4-oxadiazol-3-yl)indolin-1-yl)butanoic acids as S1P¿? agonists. Bioorg Med Chem Lett 21:6013-8 (2011)  
Target
Name:
Sphingosine 1-phosphate receptor 1
Synonyms:
CHEDG1 Endothelial differentiation G-protein coupled receptor 1 S1P1 S1PR1_HUMAN Sphingosine 1-phosphate receptor Edg-1
Type:
Enzyme
Mol. Mass.:
42836.02
Organism:
Homo sapiens (Human)
Description:
P21453
Residue:
382
  
Inhibitor
Name:
BDBM50357793
Synonyms:
CHEMBL1916570
Type:
Small organic molecule
Emp. Form.:
C22H18F3N3O6
Mol. Mass.:
477.39
SMILES:
COc1ccc(cc1OC(F)(F)F)-c1nc(no1)-c1ccc2N(CCc2c1)C(=O)CCC(O)=O
: