Target
Cytochrome P450 2C9
Ligand
BDBM50357781
Substrate
Meas. Tech.
ChEMBL_784917 (CHEMBL1920309)
IC50
34800±n/a nM
Citation
 Buzard, DHan, SThoresen, LMoody, JLopez, LKawasaki, ASchrader, TSage, CGao, YEdwards, JBarden, JThatte, JFu, LSolomon, MLiu, LAl-Shamma, HGatlin, JLe, MXing, CEspinola, SJones, RM Discovery and characterization of potent and selective 4-oxo-4-(5-(5-phenyl-1,2,4-oxadiazol-3-yl)indolin-1-yl)butanoic acids as S1P¿? agonists. Bioorg Med Chem Lett 21:6013-8 (2011)  
Target
Name:
Cytochrome P450 2C9
Synonyms:
(R)-limonene 6-monooxygenase CP2C9_HUMAN CYP2C9 Cytochrome P450 2C9 (CYP2C9 ) P-450MP P450 PB-1 | S-mephenytoin 4-hydroxylase
Type:
Enzyme
Mol. Mass.:
55636.33
Organism:
Homo sapiens (Human)
Description:
P11712
Residue:
490
  
Inhibitor
Name:
BDBM50357781
Synonyms:
CHEMBL1916559
Type:
Small organic molecule
Emp. Form.:
C22H15F6N3O4
Mol. Mass.:
499.3626
SMILES:
OC(=O)CCC(=O)N1CCc2cc(ccc12)-c1noc(n1)-c1cc(cc(c1)C(F)(F)F)C(F)(F)F
: