Target
Cytohesin-3
Ligand
BDBM50357881
Substrate
Meas. Tech.
ChEMBL_787632 (CHEMBL1918085)
Kd
300±n/a nM
Citation
 Anraku, KInoue, TSugimoto, KKudo, KOkamoto, YMorii, TMori, YOtsuka, M Design and synthesis of biotinylated inositol 1,3,4,5-tetrakisphosphate targeting Grp1 pleckstrin homology domain. Bioorg Med Chem 19:6833-41 (2011)  
Target
Name:
Cytohesin-3
Synonyms:
CYH3_RAT PH, SEC7 and coiled-coil domain-containing protein 3 SEC7 homolog C rSec7-3
Type:
PROTEIN
Mol. Mass.:
46329.05
Organism:
Rattus norvegicus
Description:
ChEMBL_787633
Residue:
400
  
Inhibitor
Name:
BDBM50357881
Synonyms:
CHEMBL1916340
Type:
Small organic molecule
Emp. Form.:
C22H43N3O20P4S
Mol. Mass.:
825.545
SMILES:
O[C@H]1[C@@H](OP(O)(=O)OCCCCCCNC(=O)CCCC[C@@H]2SC[C@@H]3NC(=O)N[C@H]23)[C@H](O)[C@@H](OP(O)(O)=O)[C@H](OP(O)(O)=O)[C@H]1OP(O)(O)=O
: