Target
Interleukin-1 receptor-associated kinase 1
Ligand
BDBM50357884
Substrate
Meas. Tech.
ChEMBL_786762 (CHEMBL1919603)
IC50
>10000±n/a nM
Citation
 Lumeras, WVidal, LVidal, BBalagué, COrellana, AMaldonado, MDomínguez, MSegarra, VCaturla, F 1,7-Naphthyridine 1-oxides as novel potent and selective inhibitors of p38 mitogen activated protein kinase. J Med Chem 54:7899-910 (2011)  
Target
Name:
Interleukin-1 receptor-associated kinase 1
Synonyms:
IRAK IRAK1 Interleukin-1 receptor-associated kinase 1 (IRAK-1)
Type:
Enzyme
Mol. Mass.:
76536.81
Organism:
Homo sapiens (Human)
Description:
P51617
Residue:
712
  
Inhibitor
Name:
BDBM50357884
Synonyms:
CHEMBL1916359
Type:
Small organic molecule
Emp. Form.:
C20H10Cl3FN2O
Mol. Mass.:
419.664
SMILES:
[O-][n+]1ccc2c(ccnc2c1-c1c(Cl)cccc1Cl)-c1ccc(F)cc1Cl
: