Target
Mitogen-activated protein kinase 14
Ligand
BDBM50357914
Substrate
Meas. Tech.
ChEMBL_787640 (CHEMBL1918093)
IC50
0.130000±n/a nM
Citation
 Lumeras, WVidal, LVidal, BBalagué, COrellana, AMaldonado, MDomínguez, MSegarra, VCaturla, F 1,7-Naphthyridine 1-oxides as novel potent and selective inhibitors of p38 mitogen activated protein kinase. J Med Chem 54:7899-910 (2011)  
Target
Name:
Mitogen-activated protein kinase 14
Synonyms:
CSAID-binding protein CSBP1 CSPB1 MAP kinase 14 MAP kinase p38 alpha MAPK14 MK14_HUMAN Mitogen-activated protein kinase p38 alpha Stress-activated protein kinase 2a | p38 MAP kinase alpha/beta
Type:
Serine/threonine-protein kinase
Mol. Mass.:
41286.76
Organism:
Homo sapiens (Human)
Description:
Q16539
Residue:
360
  
Inhibitor
Name:
BDBM50357914
Synonyms:
CHEMBL1916528
Type:
Small organic molecule
Emp. Form.:
C25H21Cl3N4O
Mol. Mass.:
499.819
SMILES:
[O-][n+]1ccc2c(cc(NC3CCNCC3)nc2c1-c1c(Cl)cccc1Cl)-c1ccccc1Cl
: