Target
5-hydroxytryptamine receptor 7
Ligand
BDBM50357989
Substrate
Meas. Tech.
ChEMBL_786345 (CHEMBL1920541)
Ki
29±n/a nM
Citation
 Zajdel, PMarciniec, KMaslankiewicz, APaluchowska, MHSatala, GPartyka, AJastrzebska-Wiesek, MWróbel, DWesolowska, ADuszynska, BBojarski, AJPawlowski, M Arene- and quinoline-sulfonamides as novel 5-HT7 receptor ligands. Bioorg Med Chem 19:6750-9 (2011)  
Target
Name:
5-hydroxytryptamine receptor 7
Synonyms:
5-HT-7 5-HT7 5-HT7S 5HT7 HTR7 | Serotonin receptor 7
Type:
G Protein-Coupled Receptor (GPCR)
Mol. Mass.:
53573.08
Organism:
Homo sapiens (Human)
Description:
P34969
Residue:
479
  
Inhibitor
Name:
BDBM50357989
Synonyms:
CHEMBL1917355
Type:
Small organic molecule
Emp. Form.:
C25H32N4O3S
Mol. Mass.:
468.612
SMILES:
CCN(CCCN1CCN(CC1)c1ccccc1OC)S(=O)(=O)c1ccc2ncccc2c1
: