Target
Cholinesterase
Ligand
BDBM50358081
Substrate
Meas. Tech.
ChEMBL_787037 (CHEMBL1918527)
IC50
406±n/a nM
Citation
 Shan, WJHuang, LZhou, QMeng, FCLi, XS Synthesis, biological evaluation of 9-N-substituted berberine derivatives as multi-functional agents of antioxidant, inhibitors of acetylcholinesterase, butyrylcholinesterase and amyloid-ß aggregation. Eur J Med Chem 46:5885-93 (2011)  
Target
Name:
Cholinesterase
Synonyms:
BCHE CHLE_HORSE | Cholinesterase
Type:
Enzyme
Mol. Mass.:
65643.35
Organism:
Equus caballus (Horse)
Description:
P81908
Residue:
574
  
Inhibitor
Name:
BDBM50358081
Synonyms:
CHEMBL541672
Type:
Small organic molecule
Emp. Form.:
C27H25N2O3
Mol. Mass.:
425.4985
SMILES:
COc1ccc2cc3-c4cc5OCOc5cc4CCn3cc2\c1=[NH+]\CCc1ccccc1
: