Target
17-beta-hydroxysteroid dehydrogenase type 1
Ligand
BDBM50358113
Substrate
Meas. Tech.
ChEMBL_786680 (CHEMBL1921533)
IC50
>100000±n/a nM
Citation
 Xu, KAl-Soud, YAWetzel, MHartmann, RWMarchais-Oberwinkler, S Triazole ring-opening leads to the discovery of potent nonsteroidal 17ß-hydroxysteroid dehydrogenase type 2 inhibitors. Eur J Med Chem 46:5978-90 (2011)  
Target
Name:
17-beta-hydroxysteroid dehydrogenase type 1
Synonyms:
17-beta-HSD 1 17-beta-hydroxysteroid dehydrogenase type 1 20-alpha-HSD E17KSR EDH17B1 EDHB17 Estradiol 17-beta-dehydrogenase 1 (17beta-HSD1) Placental 17-beta-hydroxysteroid dehydrogenase | SDR28C1
Type:
Enzyme
Mol. Mass.:
34945.13
Organism:
Homo sapiens (Human)
Description:
P14061
Residue:
328
  
Inhibitor
Name:
BDBM50358113
Synonyms:
CHEMBL1915937
Type:
Small organic molecule
Emp. Form.:
C23H23NO2
Mol. Mass.:
345.4342
SMILES:
COc1cccc(CN(C)C(=O)c2ccc(cc2)-c2cccc(C)c2)c1
: