Target
17-beta-hydroxysteroid dehydrogenase type 2
Ligand
BDBM50358127
Substrate
Meas. Tech.
ChEMBL_786678 (CHEMBL1921531)
IC50
1127±n/a nM
Citation
 Xu, KAl-Soud, YAWetzel, MHartmann, RWMarchais-Oberwinkler, S Triazole ring-opening leads to the discovery of potent nonsteroidal 17ß-hydroxysteroid dehydrogenase type 2 inhibitors. Eur J Med Chem 46:5978-90 (2011)  
Target
Name:
17-beta-hydroxysteroid dehydrogenase type 2
Synonyms:
17-beta-Hydroxysteroid Dehydrogenase 2 (17-beta-HSD2) 20-alpha-HSD EDH17B2 Estradiol 17-beta-dehydrogenase 2 (17beta-HSD2) Microsomal 17-beta-hydroxysteroid dehydrogenas Testosterone 17-beta-dehydrogenase
Type:
Oxidoreductase; single-pass type II membrane protein
Mol. Mass.:
42795.29
Organism:
Homo sapiens (Human)
Description:
Enzyme was partially purified from human placenta.
Residue:
387
  
Inhibitor
Name:
BDBM50358127
Synonyms:
CHEMBL1915954
Type:
Small organic molecule
Emp. Form.:
C20H19NO2S
Mol. Mass.:
337.435
SMILES:
COc1ccccc1-c1ccc(s1)C(=O)N(C)Cc1ccccc1
: