Target
Calpain-2 catalytic subunit
Ligand
BDBM50358149
Substrate
Meas. Tech.
ChEMBL_788735 (CHEMBL1924666)
IC50
2400±n/a nM
Citation
 Stuart, BGCoxon, JMMorton, JDAbell, ADMcDonald, DQAitken, SGJones, MABickerstaffe, R Molecular modeling: a search for a calpain inhibitor as a new treatment for cataractogenesis. J Med Chem 54:7503-22 (2011)  
Target
Name:
Calpain-2 catalytic subunit
Synonyms:
CAN2_HUMAN CANPL2 Calcium-activated neutral proteinase 2 Calpain M-type Calpain-2 (m-Calpain) Calpain-2 large subunit M-calpain calpain
Type:
Protein
Mol. Mass.:
79965.18
Organism:
Homo sapiens (Human)
Description:
Residue:
700
  
Inhibitor
Name:
BDBM50358149
Synonyms:
CHEMBL1921826
Type:
Small organic molecule
Emp. Form.:
C27H34FN3O6S2
Mol. Mass.:
579.704
SMILES:
CC(C)[C@@H]1NC(=O)[C@H](Cc2ccc(OCCCCSC[C@H](NC1=O)C=O)cc2)NS(=O)(=O)c1ccc(F)cc1
: