Target
Suppressor of tumorigenicity 14 protein
Ligand
BDBM50358191
Substrate
Meas. Tech.
ChEMBL_789883 (CHEMBL1925190)
IC50
21800±n/a nM
Citation
 Xu, ZChen, YWBattu, AWilder, PWeber, DYu, WMackerell, ADChen, LMChai, KXJohnson, MDLin, CY Targeting zymogen activation to control the matriptase-prostasin proteolytic cascade. J Med Chem 54:7567-78 (2011)  
Target
Name:
Suppressor of tumorigenicity 14 protein
Synonyms:
Epithin MT-SP1 PRSS14 SNC19 ST14_HUMAN Suppressor of tumorigenicity 14 protein TADG15
Type:
Single-pass type II membrane protein
Mol. Mass.:
94769.23
Organism:
Homo sapiens (Human)
Description:
Q9Y5Y6
Residue:
855
  
Inhibitor
Name:
BDBM50358191
Synonyms:
CHEMBL1921969
Type:
Small organic molecule
Emp. Form.:
C20H16N2O3S2
Mol. Mass.:
396.483
SMILES:
Cc1nc(sc1C)N1C(C(C(=O)c2ccccc2)C(=O)C1=O)c1cccs1
: