Target
NUAK family SNF1-like kinase 1
Ligand
BDBM50358248
Substrate
Meas. Tech.
ChEMBL_790768 (CHEMBL1926221)
IC50
>100000±n/a nM
Citation
 Lai, DYu, Svan Ofwegen, LTotzke, FProksch, PLin, W 9,10-secosteroids, protein kinase inhibitors from the Chinese gorgonian Astrogorgia sp. Bioorg Med Chem 19:6873-80 (2011)  
Target
Name:
NUAK family SNF1-like kinase 1
Synonyms:
ARK5 NUAK1 OMPHK1
Type:
PROTEIN
Mol. Mass.:
74326.51
Organism:
Homo sapiens (Human)
Description:
ChEMBL_1451343
Residue:
661
  
Inhibitor
Name:
BDBM50358248
Synonyms:
CHEMBL456294
Type:
Small organic molecule
Emp. Form.:
C27H42O3
Mol. Mass.:
414.6206
SMILES:
CC(C)CCC[C@@H](C)[C@H]1[C@@H](O)C[C@H]2[C@H](CCc3cc(O)ccc3C)C(=O)CC[C@]12C
: