Target
Beta-galactosidase
Ligand
BDBM50358322
Substrate
Meas. Tech.
ChEMBL_789302 (CHEMBL1924469)
IC50
2900±n/a nM
Citation
 Kuno, STakahashi, AOgawa, S Transformation of quercitols into 4-methylenecyclohex-5-ene-1,2,3-triol derivatives, precursors for the chemical chaperones N-octyl-4-epi-ß-valienamine (NOEV) and N-octyl-ß-valienamine (NOV). Bioorg Med Chem Lett 21:7189-92 (2011)  
Target
Name:
Beta-galactosidase
Synonyms:
β-galactosidase Beta-galactosidase/Glucosylceramidase | GLB1
Type:
Protein
Mol. Mass.:
73420.88
Organism:
Bos taurus (Bovine)
Description:
Residue:
653
  
Inhibitor
Name:
BDBM50358322
Synonyms:
CHEMBL1922580
Type:
Small organic molecule
Emp. Form.:
C15H29NO4
Mol. Mass.:
287.3951
SMILES:
CCCCCCCCN[C@@H]1C=C(CO)[C@@H](O)[C@H](O)[C@H]1O
: