Target
Glucagon receptor
Ligand
BDBM50358366
Substrate
Meas. Tech.
ChEMBL_789413 (CHEMBL1924335)
IC50
2.8±n/a nM
Citation
 Sinz, CChang, JLins, ARBrady, ECandelore, MDallas-Yang, QDing, VJiang, GLin, ZMock, SQureshi, SSalituro, GSaperstein, RShang, JSzalkowski, DTota, LVincent, SWright, MXu, SYang, XZhang, BTata, JKim, RParmee, E Discovery of cyclic guanidines as potent, orally active, human glucagon receptor antagonists. Bioorg Med Chem Lett 21:7131-6 (2011)  
Target
Name:
Glucagon receptor
Synonyms:
GCGR GLR_HUMAN Glucagon receptor (GlucR)
Type:
Enzyme
Mol. Mass.:
54026.92
Organism:
Homo sapiens (Human)
Description:
P47871
Residue:
477
  
Inhibitor
Name:
BDBM50358366
Synonyms:
CHEMBL1922714
Type:
Small organic molecule
Emp. Form.:
C27H22F6N8O3
Mol. Mass.:
620.5058
SMILES:
CCOc1cc(cc2n(Cc3ccc(cc3)C(=O)Nc3nnn[nH]3)c(=Nc3ccc(OC(F)(F)F)cc3)n(C)c12)C(F)(F)F
: