Target
Receptor tyrosine-protein kinase erbB-2
Ligand
BDBM50358433
Substrate
Meas. Tech.
ChEMBL_789674 (CHEMBL1924800)
IC50
20±n/a nM
Citation
 Ishikawa, TSeto, MBanno, HKawakita, YOorui, MTaniguchi, TOhta, YTamura, TNakayama, AMiki, HKamiguchi, HTanaka, THabuka, NSogabe, SYano, JAertgeerts, KKamiyama, K Design and synthesis of novel human epidermal growth factor receptor 2 (HER2)/epidermal growth factor receptor (EGFR) dual inhibitors bearing a pyrrolo[3,2-d]pyrimidine scaffold. J Med Chem 54:8030-50 (2011)  
Target
Name:
Receptor tyrosine-protein kinase erbB-2
Synonyms:
2.7.10.1 CD_antigen=CD340 ERBB2_HUMAN FASN/HER2 HER2 MLN19 NEU Proto-oncogene Neu Tyrosine kinase-type cell surface receptor HER2 | p185erbB2
Type:
Mol. Mass.:
137894.47
Organism:
Homo sapiens (Human)
Description:
P04626
Residue:
1255
  
Inhibitor
Name:
BDBM50358433
Synonyms:
CHEMBL1922899
Type:
Small organic molecule
Emp. Form.:
C18H12ClFN4O
Mol. Mass.:
354.765
SMILES:
Fc1cccc(Oc2ccc(Nc3ncnc4cc[nH]c34)cc2Cl)c1
: